[Cado-nfs-discuss] Gf2x error

Marcin Barański baranek2223 at wp.pl
Fri Apr 15 09:13:20 CEST 2016


Below is output of gf2x config.log file:

[mbaranski at prl gf2x]$ vi config.log

This file contains any messages produced by compilers while
running configure, to aid debugging if configure makes a mistake.

It was created by gf2x configure 1.2, which was
generated by GNU Autoconf 2.69.  Invocation command line was

  $ /home/idm/mbaranski/Cado/Cado/cado-nfs-2.2.0/gf2x/configure --disable-shared --disable-dependency-tracking --enable-fft-interface CC=/usr/bin/cc CXX=/usr/bin/c++ CFLAGS=-std=c99 -g -W -Wall -O2  -I/home/idm/mbaranski/Cado/Biblioteki/Gmp/gmp-6.1.0 -I/home/idm/mbaranski/Cado/Cado/cado-nfs-2.2.0 CXXFLAGS=-std=c++11 -g -W -Wall -Wno-literal-suffix -O2  -I/home/idm/mbaranski/Cado/Biblioteki/Gmp/gmp-6.1.0 -I/home/idm/mbaranski/Cado/Cado/cado-nfs-2.2.0 LDFLAGS=/home/idm/mbaranski/libs/ 
-Wl,-rpath,/home/idm/mbaranski/libs/lib -L/home/idm/mbaranski/libs/lib

## --------- ##
## Platform. ##
## --------- ##

hostname = prl.hpc.cslab.pl
uname -m = x86_64
uname -r = 3.10.0-229.20.1.el7.x86_64
uname -s = Linux
uname -v = #1 SMP Tue Nov 3 19:10:07 UTC 2015

/usr/bin/uname -p = x86_64
/bin/uname -X     = unknown

/bin/arch              = x86_64
/usr/bin/arch -k       = unknown
/usr/convex/getsysinfo = unknown
/usr/bin/hostinfo      = unknown
/bin/machine           = unknown
/usr/bin/oslevel       = unknown
/bin/universe          = unknown

PATH: /opt/rh/python33/root/usr/bin
PATH: /usr/local/bin
PATH: /usr/bin
PATH: /usr/local/sbin
PATH: /usr/sbin


## ----------- ##
## Core tests. ##
## ----------- ##

configure:2622: checking build system type
configure:2636: result: x86_64-unknown-linux-gnu
configure:2656: checking host system type
configure:2669: result: x86_64-unknown-linux-gnu
configure:2689: checking target system type
configure:2702: result: x86_64-unknown-linux-gnu
configure:2787: checking for gcc
configure:2814: result: /usr/bin/cc
configure:3043: checking for C compiler version
configure:3052: /usr/bin/cc --version >&5
cc (GCC) 4.8.3 20140911 (Red Hat 4.8.3-9)
Copyright (C) 2013 Free Software Foundation, Inc.
This is free software; see the source for copying conditions.  There is NO
warranty; not even for MERCHANTABILITY or FITNESS FOR A PARTICULAR PURPOSE.

configure:3063: $? = 0
configure:3052: /usr/bin/cc -v >&5
Using built-in specs.
COLLECT_GCC=/usr/bin/cc
COLLECT_LTO_WRAPPER=/usr/libexec/gcc/x86_64-redhat-linux/4.8.3/lto-wrapper
Target: x86_64-redhat-linux
Configured with: ../configure --prefix=/usr --mandir=/usr/share/man --infodir=/usr/share/info --with-bugurl=http://bugzilla.redhat.com/bugzilla --enable-bootstrap --enable-shared --enable-threads=posix --enable-checking=release --with-system-zlib --enable-__cxa_atexit --disable-libunwind-exceptions --enable-gnu-unique-object --enable-linker-build-id --with-linker-hash-style=gnu --enable-languages=c,c++,objc,obj-c++,java,fortran,ada,go,lto --enable-plugin --enable-initfini-array 
--disable-libgcj --with-isl=/builddir/build/BUILD/gcc-4.8.3-20140911/obj-x86_64-redhat-linux/isl-install --with-cloog=/builddir/build/BUILD/gcc-4.8.3-20140911/obj-x86_64-redhat-linux/cloog-install --enable-gnu-indirect-function --with-tune=generic --with-arch_32=x86-64 --build=x86_64-redhat-linux
Thread model: posix
gcc version 4.8.3 20140911 (Red Hat 4.8.3-9) (GCC)
configure:3063: $? = 0
configure:3052: /usr/bin/cc -V >&5
cc: error: unrecognized command line option '-V'
cc: fatal error: no input files
compilation terminated.
configure:3063: $? = 4
configure:3052: /usr/bin/cc -qversion >&5
cc: error: unrecognized command line option '-qversion'
cc: fatal error: no input files
compilation terminated.
configure:3063: $? = 4
configure:3083: checking whether the C compiler works
configure:3105: /usr/bin/cc -std=c99 -g -W -Wall -O2  -I/home/idm/mbaranski/Cado/Biblioteki/Gmp/gmp-6.1.0 -I/home/idm/mbaranski/Cado/Cado/cado-nfs-2.2.0  /home/idm/mbaranski/libs/ -Wl,-rpath,/home/idm/mbaranski/libs/lib -L/home/idm/mbaranski/libs/lib conftest.c  >&5
/home/idm/mbaranski/libs/: file not recognized: Is a directory
collect2: error: ld returned 1 exit status
configure:3109: $? = 1
configure:3147: result: no
configure: failed program was:
| /* confdefs.h */
| #define PACKAGE_NAME "gf2x"
| #define PACKAGE_TARNAME "gf2x"
| #define PACKAGE_VERSION "1.2"
| #define PACKAGE_STRING "gf2x 1.2"
| #define PACKAGE_BUGREPORT ""
| #define PACKAGE_URL ""
| /* end confdefs.h.  */
|
| int
| main ()
| {
|
|   ;
|   return 0;
| }
configure:3152: error: in `/home/idm/mbaranski/Cado/Cado/cado-nfs-2.2.0/build/prl.hpc.cslab.pl/gf2x':
configure:3154: error: C compiler cannot create executables
See `config.log' for more details

## ---------------- ##
## Cache variables. ##
## ---------------- ##

ac_cv_build=x86_64-unknown-linux-gnu
ac_cv_env_CCC_set=
ac_cv_env_CCC_value=
ac_cv_env_CC_FOR_BUILD_set=
ac_cv_env_CC_FOR_BUILD_value=
ac_cv_env_CC_set=set
ac_cv_env_CC_value=/usr/bin/cc
ac_cv_env_CFLAGS_set=set
ac_cv_env_CFLAGS_value='-std=c99 -g -W -Wall -O2  -I/home/idm/mbaranski/Cado/Biblioteki/Gmp/gmp-6.1.0 -I/home/idm/mbaranski/Cado/Cado/cado-nfs-2.2.0'
ac_cv_env_CPPFLAGS_set=
ac_cv_env_CPPFLAGS_value=
ac_cv_env_CPP_set=
ac_cv_env_CPP_value=
ac_cv_env_CXXCPP_set=
ac_cv_env_CXXCPP_value=
ac_cv_env_CXXFLAGS_set=set
ac_cv_env_CXXFLAGS_value='-std=c++11 -g -W -Wall -Wno-literal-suffix -O2  -I/home/idm/mbaranski/Cado/Biblioteki/Gmp/gmp-6.1.0 -I/home/idm/mbaranski/Cado/Cado/cado-nfs-2.2.0'
ac_cv_env_CXX_set=set
ac_cv_env_CXX_value=/usr/bin/c++
ac_cv_env_LDFLAGS_set=set
ac_cv_env_LDFLAGS_value='/home/idm/mbaranski/libs/ -Wl,-rpath,/home/idm/mbaranski/libs/lib -L/home/idm/mbaranski/libs/lib'
ac_cv_env_LIBS_set=
ac_cv_env_LIBS_value=
ac_cv_env_build_alias_set=
ac_cv_env_build_alias_value=
ac_cv_env_host_alias_set=
ac_cv_env_host_alias_value=
ac_cv_env_target_alias_set=
ac_cv_env_target_alias_value=
ac_cv_host=x86_64-unknown-linux-gnu
ac_cv_prog_ac_ct_CC=/usr/bin/cc
ac_cv_target=x86_64-unknown-linux-gnu

## ----------------- ##
## Output variables. ##
## ----------------- ##

ACLOCAL=''
AMDEPBACKSLASH=''
AMDEP_FALSE=''
AMDEP_TRUE=''
AMTAR=''
AM_BACKSLASH=''
AM_DEFAULT_V=''
AM_DEFAULT_VERBOSITY=''
AM_V=''
AR=''
AUTOCONF=''
AUTOHEADER=''
AUTOMAKE=''
AWK=''
CC='/usr/bin/cc'
CCDEPMODE=''
CC_FOR_BUILD=''
CFLAGS='-std=c99 -g -W -Wall -O2  -I/home/idm/mbaranski/Cado/Biblioteki/Gmp/gmp-6.1.0 -I/home/idm/mbaranski/Cado/Cado/cado-nfs-2.2.0'
CPP=''
CPPFLAGS=''
CXX='/usr/bin/c++'
CXXCPP=''
CXXDEPMODE=''
CXXFLAGS='-std=c++11 -g -W -Wall -Wno-literal-suffix -O2  -I/home/idm/mbaranski/Cado/Biblioteki/Gmp/gmp-6.1.0 -I/home/idm/mbaranski/Cado/Cado/cado-nfs-2.2.0'
CYGPATH_W=''
DEFS=''
DEPDIR=''
DLLTOOL=''
DSYMUTIL=''
DUMPBIN=''
ECHO_C=''
ECHO_N='-n'
ECHO_T=''
EGREP=''
ENABLE_FFT_INTERFACE_FALSE=''
ENABLE_FFT_INTERFACE_TRUE=''
EXEEXT=''
EXEEXT_FOR_BUILD=''
FGREP=''
GF2X_32BIT_SOURCES_FALSE=''
GF2X_32BIT_SOURCES_TRUE=''
GF2X_64BIT_SOURCES_FALSE=''
GF2X_64BIT_SOURCES_TRUE=''
GF2X_PCLMUL_AVAILABLE_FALSE=''
GF2X_PCLMUL_AVAILABLE_TRUE=''
GF2X_SSE2_AVAILABLE_FALSE=''
GF2X_SSE2_AVAILABLE_TRUE=''
GF2X_WORDSIZE=''
GPL_CODE_PRESENT_FALSE=''
GPL_CODE_PRESENT_TRUE=''
GREP=''
INSTALL_DATA=''
INSTALL_PROGRAM=''
INSTALL_SCRIPT=''
INSTALL_STRIP_PROGRAM=''
LD=''
LDFLAGS='/home/idm/mbaranski/libs/ -Wl,-rpath,/home/idm/mbaranski/libs/lib -L/home/idm/mbaranski/libs/lib'
LIBOBJS=''
LIBS=''
LIBTOOL=''
LIPO=''
LN_S=''
LTLIBOBJS=''
MAINT=''
MAINTAINER_MODE_FALSE=''
MAINTAINER_MODE_TRUE=''
MAKEINFO=''
MANIFEST_TOOL=''
MAYBE_APPS=''
MKDIR_P=''
NM=''
NMEDIT=''
OBJDUMP=''
OBJEXT=''
OTOOL64=''
OTOOL=''
PACKAGE=''
PACKAGE_BUGREPORT=''
PACKAGE_NAME='gf2x'
PACKAGE_STRING='gf2x 1.2'
PACKAGE_TARNAME='gf2x'
PACKAGE_URL=''
PACKAGE_VERSION='1.2'
PATH_SEPARATOR=':'
RANLIB=''
SED=''
SET_MAKE=''
SHELL='/bin/sh'
STRIP=''
VERSION=''
WORDSIZE_IS_64_FALSE=''
WORDSIZE_IS_64_TRUE=''
ac_ct_AR=''
ac_ct_CC='/usr/bin/cc'
ac_ct_CXX=''
ac_ct_DUMPBIN=''
am__EXEEXT_FALSE=''
am__EXEEXT_TRUE=''
am__fastdepCC_FALSE=''
am__fastdepCC_TRUE=''
am__fastdepCXX_FALSE=''
am__fastdepCXX_TRUE=''
am__include=''
am__isrc=''
am__leading_dot=''
am__nodep=''
am__quote=''
am__tar=''
am__untar=''
bindir='${exec_prefix}/bin'
build='x86_64-unknown-linux-gnu'
build_alias=''
build_cpu='x86_64'
build_os='linux-gnu'
build_vendor='unknown'
datadir='${datarootdir}'
datarootdir='${prefix}/share'
docdir='${datarootdir}/doc/${PACKAGE_TARNAME}'
dvidir='${docdir}'
exec_prefix='NONE'
gf2x_lib_version=''
host='x86_64-unknown-linux-gnu'
host_alias=''
host_cpu='x86_64'
host_os='linux-gnu'
host_vendor='unknown'
htmldir='${docdir}'
includedir='${prefix}/include'
infodir='${datarootdir}/info'
install_sh=''
libdir='${exec_prefix}/lib'
libexecdir='${exec_prefix}/libexec'
localedir='${datarootdir}/locale'
localstatedir='${prefix}/var'
mandir='${datarootdir}/man'
mkdir_p=''
oldincludedir='/usr/include'
pdfdir='${docdir}'
prefix='NONE'
program_transform_name='s,x,x,'
psdir='${docdir}'
runstatedir='${localstatedir}/run'
sbindir='${exec_prefix}/sbin'
sharedstatedir='${prefix}/com'
sysconfdir='${prefix}/etc'
target='x86_64-unknown-linux-gnu'
target_alias=''
target_cpu='x86_64'
target_os='linux-gnu'
target_vendor='unknown'

## ----------- ##
## confdefs.h. ##
## ----------- ##

/* confdefs.h */
#define PACKAGE_NAME "gf2x"
#define PACKAGE_TARNAME "gf2x"
#define PACKAGE_VERSION "1.2"
#define PACKAGE_STRING "gf2x 1.2"
#define PACKAGE_BUGREPORT ""
#define PACKAGE_URL ""

configure: exit 77

Any advices?

M.Barański










More information about the Cado-nfs-discuss mailing list