[Crac-bugs] trying to install crac

Mikaël Salson mikael.salson at lifl.fr
Mar 21 Mai 15:02:40 CEST 2013


Dear Jorge,

I guess you need the pthread library. Can you install it and try again?

You raised an interesting point, we forgot to test the existence of that 
library during the ``configure'' step. Thank you!

Mikael

On 20/05/2013 18:58, Jorge Meléndez wrote:
> Hi!
> I´ve trying to install crac from source on a macpro and getting these errors
>
> PASS: testPairedEnd
> Semaphore initialization for multi-threading
> : Function not implemented
> FAIL: testVariableFixed
> Semaphore initialization for multi-threading
> : Function not implemented
> FAIL: testConsistency
> =================================================2 of 3 tests failed
> Please report to crac-gkarrays at lists.gforge.inria.fr
> =================================================make[4]: *** [check-TESTS] Error 1
> make[3]: *** [check-am] Error 2
> make[2]: *** [check-recursive] Error 1
> make[1]: *** [check-recursive] Error 1
> make: *** [check-recursive] Error 1
>
> Do I need a dependency which escapes me?
> I´ll appreciate any help
> Best
> Jorge
>



More information about the Crac-bugs mailing list