[Ecm-discuss] ecm-6.3 error on gcc farm's gcc45

Jason jason at njkfrudils.plus.com
Sam 28 Mai 12:02:09 CEST 2011


Hi

Using 

./configure CC=gcc-4.3 && make

 we get this error

mv -f .deps/libecm_la-factor.Tpo .deps/libecm_la-factor.Plo
/bin/bash ./libtool  --tag=CC   --mode=compile gcc-4.3 -DHAVE_CONFIG_H -I.     
-g -O2 -MT libecm_la-sp.lo -MD -MP -MF .deps/libecm_la-sp.Tpo -c -o libecm_la-
sp.lo `test -f 'sp.c' || echo './'`sp.c
libtool: compile:  gcc-4.3 -DHAVE_CONFIG_H -I. -g -O2 -MT libecm_la-sp.lo -MD 
-MP -MF .deps/libecm_la-sp.Tpo -c sp.c -o libecm_la-sp.o
mv -f .deps/libecm_la-sp.Tpo .deps/libecm_la-sp.Plo
/bin/bash ./libtool  --tag=CC   --mode=compile gcc-4.3 -DHAVE_CONFIG_H -I.     
-g -O2 -MT libecm_la-spv.lo -MD -MP -MF .deps/libecm_la-spv.Tpo -c -o 
libecm_la-spv.lo `test -f 'spv.c' || echo './'`spv.c
libtool: compile:  gcc-4.3 -DHAVE_CONFIG_H -I. -g -O2 -MT libecm_la-spv.lo -MD 
-MP -MF .deps/libecm_la-spv.Tpo -c spv.c -o libecm_la-spv.o
spv.c: In function ‚spv_pwmul‚:
spv.c:157: error: unknown register name ‚%xmm7‚ in ‚asm‚
spv.c:157: error: unknown register name ‚%xmm6‚ in ‚asm‚
spv.c:157: error: unknown register name ‚%xmm5‚ in ‚asm‚
spv.c:157: error: unknown register name ‚%xmm3‚ in ‚asm‚
spv.c:157: error: unknown register name ‚%xmm2‚ in ‚asm‚
spv.c:157: error: unknown register name ‚%xmm1‚ in ‚asm‚
spv.c:157: error: unknown register name ‚%xmm0‚ in ‚asm‚
spv.c: In function ‚spv_mul_sp‚:
spv.c:327: error: unknown register name ‚%xmm7‚ in ‚asm‚
spv.c:327: error: unknown register name ‚%xmm6‚ in ‚asm‚
spv.c:327: error: unknown register name ‚%xmm5‚ in ‚asm‚
spv.c:327: error: unknown register name ‚%xmm4‚ in ‚asm‚
spv.c:327: error: unknown register name ‚%xmm3‚ in ‚asm‚
spv.c:327: error: unknown register name ‚%xmm2‚ in ‚asm‚
spv.c:327: error: unknown register name ‚%xmm1‚ in ‚asm‚
spv.c:327: error: unknown register name ‚%xmm0‚ in ‚asm‚
make[2]: *** [libecm_la-spv.lo] Error 1
make[2]: Leaving directory `/home/jasonmoxham/gcc45.tAsOpx/ecm-6.3'
make[1]: *** [all-recursive] Error 1
make[1]: Leaving directory `/home/jasonmoxham/gcc45.tAsOpx/ecm-6.3'
make: *** [all] Error 2

dont even need to set the CC variable so the error occurs even with gcc-4.4

Thanks
Jason



More information about the Ecm-discuss mailing list